UWMLSC > Beowulf Systems > Medusa
  
Ganglia:
failed after 'rpmbuild -ba ganglia.spec'

The Ganglia Meta Daemon uses the Round-Robin Database Tool (rrdtool)
for storing historical information.  You have chosen to compile the
monitoring core with gmetad but librrd.a could not be found.  Please
visit http://www.rrdtool.com/, download rrdtool and then try again

NOTE: the rrdtool library (librrd) will NOT need to be installed on
every machine running gmetad only the machine you are compiling gmetad
on since librrd is statically linked.

+ make
make: *** No targets specified and no makefile found.  Stop.
error: Bad exit status from /var/tmp/rpm-tmp.71918 (%build)


RPM build errors:
    Bad exit status from /var/tmp/rpm-tmp.71918 (%build)

--------------------------------------------------------------------------------------
Smartmontools:
failed after 'rpm -Uvh smartmontools.rpm'

Preparing...                ########################################### [100%]
        file /etc/rc.d/init.d/smartd from install of smartmontools-5.26-1FC3
conflicts with file from package kernel-utils-2.4-13.1.39
        file /usr/sbin/smartctl from install of smartmontools-5.26-1FC3
conflicts with file from package kernel-utils-2.4-13.1.39
        file /usr/sbin/smartd from install of smartmontools-5.26-1FC3
conflicts with file from package kernel-utils-2.4-13.1.39
        file /usr/share/man/man5/smartd.conf.5.gz from install of
smartmontools-5.26-1FC3 conflicts with file from package
kernel-utils-2.4-13.1.39
        file /usr/share/man/man8/smartctl.8.gz from install of
smartmontools-5.26-1FC3 conflicts with file from package
kernel-utils-2.4-13.1.39
        file /usr/share/man/man8/smartd.8.gz from install of
smartmontools-5.26-1FC3 conflicts with file from package
kernel-utils-2.4-13.1.39

--------------------------------------------------------------------------------------
ether-wake:
failed after 'rpmbuild -ba ether-wake.spec'

In file included from ether-wake.c:87:
/usr/include/sys/socket.h: At top level:
/usr/include/sys/socket.h:136: error: syntax error before "size_t"
/usr/include/sys/socket.h:143: error: syntax error before "size_t"
/usr/include/sys/socket.h:150: error: syntax error before "size_t"
/usr/include/sys/socket.h:161: error: syntax error before "size_t"
/usr/include/gconv.h:176: warning: array '__data' assumed to have one element
/usr/include/bits/socket.h:237: warning: array '__cmsg_data' assumed to have
one element
error: Bad exit status from /var/tmp/rpm-tmp.71646 (%build)


RPM build errors:
    Bad exit status from /var/tmp/rpm-tmp.71646 (%build)

--------------------------------------------------------------------------------------
fan-monitor:
failed after 'rpmbuild -ba fan-monitor.spec'

fan.c: In function `readproc':
fan.c:209: warning: implicit declaration of function `atomic_inc'
fan.c:209: error: `__this_module' undeclared (first use in this function)
fan.c:209: error: (Each undeclared identifier is reported only once
fan.c:209: error: for each function it appears in.)
fan.c:215: error: `d' undeclared (first use in this function)
fan.c:217: error: `count' undeclared (first use in this function)
fan.c:217: error: `page' undeclared (first use in this function)
fan.c:237: warning: implicit declaration of function `printk'
fan.c:238: error: `EINVAL' undeclared (first use in this function)
fan.c:240: warning: implicit declaration of function `atomic_dec'
fan.c: In function `gettwoints':
fan.c:254: warning: implicit declaration of function `copy_from_user'
fan.c:269: error: `EINVAL' undeclared (first use in this function)
fan.c:273: warning: implicit declaration of function `simple_strtol'
fan.c: At top level:
fan.c:323: warning: "struct file" declared inside parameter list
fan.c:323: warning: its scope is only this definition or declaration, which is
probably not what you want
fan.c: In function `writeproc':
fan.c:329: error: `EPERM' undeclared (first use in this function)
fan.c:399: error: `EINVAL' undeclared (first use in this function)
fan.c: In function `init_module':
fan.c:428: error: `EINVAL' undeclared (first use in this function)
fan.c:457: error: `ENODEV' undeclared (first use in this function)
fan.c:491: warning: implicit declaration of function `check_region'
fan.c:498: warning: implicit declaration of function `request_region'
fan.c:508: warning: implicit declaration of function `create_proc_entry'
fan.c:509: error: `S_IFDIR' undeclared (first use in this function)
fan.c:509: error: `S_IRUGO' undeclared (first use in this function)
fan.c:509: error: `S_IXUGO' undeclared (first use in this function)
fan.c:509: error: `NULL' undeclared (first use in this function)
fan.c:509: warning: assignment makes pointer from integer without a cast
fan.c:514: error: `S_IFREG' undeclared (first use in this function)
fan.c:514: error: `S_IWUSR' undeclared (first use in this function)
fan.c:515: warning: assignment makes pointer from integer without a cast
fan.c:525: error: dereferencing pointer to incomplete type
fan.c:526: error: dereferencing pointer to incomplete type
fan.c:529: error: dereferencing pointer to incomplete type
fan.c:543: warning: implicit declaration of function `release_region'
fan.c:547: warning: implicit declaration of function `remove_proc_entry'
fan.c:552: error: `ENOMEM' undeclared (first use in this function)
fan.c: In function `cleanup_module':
fan.c:564: error: `NULL' undeclared (first use in this function)
fan.c: In function `readproc':
fan.c:209: warning: value computed is not used
fan.c:240: warning: value computed is not used
make: *** [fan.o] Error 1
error: Bad exit status from /var/tmp/rpm-tmp.69726 (%build)


RPM build errors:
    Bad exit status from /var/tmp/rpm-tmp.69726 (%build)

-----------------------------------------------------------------------------------

Check this page for dead links, sloppy HTML, or a bad style sheet; or strip it for printing.
Any opinions, findings, and conclusions or recommendations expressed in this material are those of the author(s) and do not necessarily reflect the views of the National Science Foundation.